���ی����Ə��ԍ�,�ی��Ҕԍ�,�ی��Җ���,�@�l�ԍ�,�\����-�@�l����,�\����-�@�l��,�\����-�X�֔ԍ�,�\����-���ݒn,�\����-�d�b�ԍ�,�\����-FAX�ԍ�,�\����-�@�l���,�\����-������,���Ə�-���̶�,���Ə�-����,���Ə�-�d�b�ԍ�,���Ə�-�X�֔ԍ�,���Ə�-���ݒn�R�[�h,���Ə�-���ݒn,���޽���,���Ə�-���̶�-���޽,���Ə�-����-���޽,���Ə�-���ʓd�b�ԍ�,���Ə�-FAX�ԍ�,�c�Ɠ�-��,�c�Ɠ�-��,�c�Ɠ�-��,�c�Ɠ�-��,�c�Ɠ�-��,�c�Ɠ�-��,�c�Ɠ�-�y,�c�Ɠ�-�j,�c�Ɠ�-���N�ԋx��,���p���
910110121,0,�s���{��,3005410,�خ�γ��ݼ����ֳ����,��Ö@�l�Вc�m����,3200038,�Ȗ،��F�s�{�s�����u�꒚��7��38��,028-622-2222,028-624-2228,��Ö@�l,,�ϵ�ޮ���,�����a�@,028-622-2222,3200038,9201,�Ȗ،��F�s�{�s�����u�꒚��7��38��,���×{�^��Î{��,�ϵ�ޮ���,�����a�@,028-622-2222,028-624-2228,,,,,,,,,,
910110121,0,�s���{��,3005410,�خ�γ��ݼ����ֳ����,��Ö@�l�Вc�m����,3200038,�Ȗ،��F�s�{�s�����u�꒚��7��38��,028-622-2222,028-624-2228,��Ö@�l,,�ϵ�ޮ���,�����a�@,028-622-2222,3200038,9201,�Ȗ،��F�s�{�s�����u�꒚��7��38��,�ʏ����n�r���e�[�V����,�ϵ�ޮ���,�����a�@,028-622-2222,028-624-2228,,��,��,��,��,��,��,,8/14�`8/15�C12/31�`1/3,40
910112200,0,�s���{��,,����ιݲخ����·���޳�б�,�Ȗؕی���Ð��������g��,3200061,�Ȗ،��F�s�{�s��ؒ��񒚖�1028�Ԓn17,028-600-1608,028-600-1609,����,,��������޼�خ��ޮ,�����ӂ��ΐf�Ï�,028-684-6200,3210164,9201,�Ȗ،��F�s�{�s�o�t�꒚��13��56��,�ʏ����n�r���e�[�V����,��������޼�خ��ޮ,�����ӂ��ΐf�Ï�,028-684-6200,028-684-6208,,��,��,��,��,��,,,12/29�`1/3,10
950180000,0,�s���{��,,�خ�γ��ݼ���ݲ��ݶ�,��Ö@�l�Вc��S��,3200071,�Ȗ،��F�s�{�s���45�Ԓn�P4,028-665-3366,028-665-3368,��Ö@�l,,�خ�γ��ݼ���ݲ��ݶ�����۳���ιݼ��ɻ��ɻ�,��Ö@�l�Вc��S����V�l�ی��{�ݖ��̗�,028-666-2225,3200071,9201,�Ȗ،��F�s�{�s���561�Ԓn1,���V�l�ی��{��,�خ�γ��ݼ���ݲ��ݶ���μɻ��ɻ�,��Ö@�l�Вc��S����V�l�ی��{�ݖ��̗�,028-666-2225,028-666-2227,,,,,,,,,,
950180000,0,�s���{��,,�خ�γ��ݼ���ݲ��ݶ�,��Ö@�l�Вc��S��,3200071,�Ȗ،��F�s�{�s���45�Ԓn�P4,028-665-3366,028-665-3368,��Ö@�l,,�خ�γ��ݼ���ݲ��ݶ�����۳���ιݼ��ɻ��ɻ�,��Ö@�l�Вc��S����V�l�ی��{�ݖ��̗�,028-666-2225,3200071,9201,�Ȗ،��F�s�{�s���561�Ԓn1,�ʏ����n�r���e�[�V����,�خ�γ��ݼ���ݲ��ݶ�����۳���ιݼ��ɻ��ɻ�,��Ö@�l�Вc��S����V�l�ی��{�ݖ��̗�,028-666-2225,028-666-2227,,��,��,��,��,��,,��,�N���N�n,50
950180018,0,�s���{��,3001047,�خ�γ���θĶ�,��Ö@�l�k�l��,3210901,�Ȗ،��F�s�{�s���o��368�Ԓn8,028-664-1551,028-660-0819,��Ö@�l,,����۳���ιݼ�³���Լ��ްΰ�,���V�l�ی��{�݉F�s�{�V���o�[�z�[��,028-660-7800,3210901,9201,�Ȗ،��F�s�{�s���o��413�Ԓn,���V�l�ی��{��,����۳���ιݼ�³���Լ��ްΰ�,���V�l�ی��{�݉F�s�{�V���o�[�z�[��,028-660-7800,028-660-7805,,,,,,,,,,
950180018,0,�s���{��,3001047,�خ�γ���θĶ�,��Ö@�l�k�l��,3210901,�Ȗ،��F�s�{�s���o��368�Ԓn8,028-664-1551,028-660-0819,��Ö@�l,,����۳���ιݼ�³���Լ��ްΰ�,���V�l�ی��{�݉F�s�{�V���o�[�z�[��,028-660-7800,3210901,9201,�Ȗ،��F�s�{�s���o��413�Ԓn,�Z�������×{���,����۳���ιݼ�³���Լ��ްΰ�,���V�l�ی��{�݉F�s�{�V���o�[�z�[��,028-660-7800,028-660-7805,,,,,,,,,,
950180018,0,�s���{��,3001047,�خ�γ���θĶ�,��Ö@�l�k�l��,3210901,�Ȗ،��F�s�{�s���o��368�Ԓn8,028-664-1551,028-660-0819,��Ö@�l,,����۳���ιݼ�³���Լ��ްΰ�,���V�l�ی��{�݉F�s�{�V���o�[�z�[��,028-660-7800,3210901,9201,�Ȗ،��F�s�{�s���o��413�Ԓn,�ʏ����n�r���e�[�V����,����۳���ιݼ�³���Լ��ްΰ�,���V�l�ی��{�݉F�s�{�V���o�[�z�[��,028-660-7800,028-66-7805,,��,��,��,��,��,��,��,1/1�`1/3,50
950180018,0,�s���{��,3001047,�خ�γ���θĶ�,��Ö@�l�k�l��,3210901,�Ȗ،��F�s�{�s���o��368�Ԓn8,028-664-1551,028-660-0819,��Ö@�l,,����۳���ιݼ�³���Լ��ްΰ�,���V�l�ی��{�݉F�s�{�V���o�[�z�[��,028-660-7800,3210901,9201,�Ȗ،��F�s�{�s���o��413�Ԓn,�K�⃊�n�r���e�[�V����,����۳���ιݼ�³���Լ��ްΰ�,���V�l�ی��{�݉F�s�{�V���o�[�z�[��,028-660-7800,028-660-7805,,��,��,��,��,��,,,1/1�`1/3,
950180026,0,�s���{��,1009729,����̸�γ���γ����,�Љ���@�l�󐶉�,3200075,�Ȗ،��F�s�{�s��ؖ{��2141�Ԓn,028-665-5633,028-665-5635,�Љ���@�l�i�Ћ��ȊO�j,,۳���ιݼ��ʸ׸��,�V�l�ی��{�ݔ��y��,028-665-7171,3200075,9201,�Ȗ،��F�s�{�s��ؖ{��2140�Ԓn2,���V�l�ی��{��,۳���ιݼ��ʸ׸��,�V�l�ی��{�ݔ��y��,028-665-7171,028-665-7177,,,,,,,,,,
950180026,9201,�F�s�{�s,1009729,����̸�γ���γ����,�Љ���@�l�󐶉�,3200075,�Ȗ،��F�s�{�s��ؖ{��2141�Ԓn,028-665-5633,028-665-5635,�Љ���@�l�i�Ћ��ȊO�j,,۳���ιݼ��ʸ׸��,�V�l�ی��{�ݔ��y��,028-665-7171,3200075,9201,�Ȗ،��F�s�{�s��ؖ{��2140�Ԓn2,������x��,۳���ιݼ��ʸ׸��,�V�l�ی��{�ݔ��y��,028-665-7171,028-665-7177,,��,��,��,��,��,��,,12/31�`1/3,
950180026,0,�s���{��,1009729,����̸�γ���γ����,�Љ���@�l�󐶉�,3200075,�Ȗ،��F�s�{�s��ؖ{��2141�Ԓn,028-665-5633,028-665-5635,�Љ���@�l�i�Ћ��ȊO�j,,۳���ιݼ��ʸ׸��,�V�l�ی��{�ݔ��y��,028-665-7171,3200075,9201,�Ȗ،��F�s�{�s��ؖ{��2140�Ԓn2,�Z�������×{���,۳���ιݼ��ʸ׸��,�V�l�ی��{�ݔ��y��,028-665-7171,028-665-7177,,,,,,,,,,
950180026,0,�s���{��,1009729,����̸�γ���γ����,�Љ���@�l�󐶉�,3200075,�Ȗ،��F�s�{�s��ؖ{��2141�Ԓn,028-665-5633,028-665-5635,�Љ���@�l�i�Ћ��ȊO�j,,۳���ιݼ��ʸ׸��,�V�l�ی��{�ݔ��y��,028-665-7171,3200075,9201,�Ȗ،��F�s�{�s��ؖ{��2140�Ԓn2,�ʏ����n�r���e�[�V����,۳���ιݼ��ʸ׸��,�V�l�ی��{�ݔ��y��,028-665-7171,028-665-7177,,��,��,��,��,��,��,,12/31�`1/3,40
950180026,0,�s���{��,1009729,����̸�γ���γ����,�Љ���@�l�󐶉�,3200075,�Ȗ،��F�s�{�s��ؖ{��2141�Ԓn,028-665-5633,028-665-5635,�Љ���@�l�i�Ћ��ȊO�j,,۳���ιݼ��ʸ׸��,�V�l�ی��{�ݔ��y��,028-665-7171,3200075,9201,�Ȗ،��F�s�{�s��ؖ{��2140�Ԓn2,�K�⃊�n�r���e�[�V����,۳���ιݼ��ʸ׸��,�V�l�ی��{�ݔ��y��,028-665-7171,028-665-7177,,��,��,��,��,��,,,12/31�`1/3,
950180034,0,�s���{��,3001351,�خ�γ��ݳ����,��Ö@�l�F�s�{,3210912,�Ȗ،��F�s�{�s�Έ䒬3385�Ԓn,028-656-8600,028-656-3877,��Ö@�l,,۳���ιݼ�³���Ա���߱,�V�l�ی��{�݉F�s�{�A���g�s�A,028-656-7717,3210912,9201,�Ȗ،��F�s�{�s�Έ䒬3385�Ԓn,���V�l�ی��{��,۳���ιݼ�³���Ա���߱,�V�l�ی��{�݉F�s�{�A���g�s�A,028-656-7717,028-656-3566,,,,,,,,,,
950180034,0,�s���{��,3001351,�خ�γ��ݳ����,��Ö@�l�F�s�{,3210912,�Ȗ،��F�s�{�s�Έ䒬3385�Ԓn,028-656-8600,028-656-3877,��Ö@�l,,۳���ιݼ�³���Ա���߱,�V�l�ی��{�݉F�s�{�A���g�s�A,028-656-7717,3210912,9201,�Ȗ،��F�s�{�s�Έ䒬3385�Ԓn,�Z�������×{���,۳���ιݼ�³���Ա���߱,�V�l�ی��{�݉F�s�{�A���g�s�A,028-656-7717,028-656-3566,,,,,,,,,,
950180042,0,�s���{��,3001039,�خ�γ���γĸ��,��Ö@�l�񓿉�,3200834,�Ȗ،��F�s�{�s�z��l����6��34��,028-658-2122,028-658-2123,��Ö@�l,,����۳���ιݼ�� ֳ��,���V�l�ی��{�ݗz��,028-658-2122,3200834,9201,�Ȗ،��F�s�{�s�z��l����6��34��,���V�l�ی��{��,����۳���ιݼ��ֳ��,���V�l�ی��{�ݗz��,028-658-2122,028-658-2123,,,,,,,,,,
950180042,0,�s���{��,3001039,�خ�γ���γĸ��,��Ö@�l�񓿉�,3200834,�Ȗ،��F�s�{�s�z��l����6��34��,028-658-2122,028-658-2123,��Ö@�l,,����۳���ιݼ�� ֳ��,���V�l�ی��{�ݗz��,028-658-2122,3200834,9201,�Ȗ،��F�s�{�s�z��l����6��34��,�Z�������×{���,����۳���ιݼ��ֳ��,���V�l�ی��{�ݗz��,,,,,,,,,,,,
950180042,0,�s���{��,3001039,�خ�γ���γĸ��,��Ö@�l�񓿉�,3200834,�Ȗ،��F�s�{�s�z��l����6��34��,028-658-2122,028-658-2123,��Ö@�l,,����۳���ιݼ�� ֳ��,���V�l�ی��{�ݗz��,028-658-2122,3200834,9201,�Ȗ،��F�s�{�s�z��l����6��34��,�ʏ����n�r���e�[�V����,����۳���ιݼ��ֳ��,���V�l�ی��{�ݗz��,,,,��,��,��,��,��,��,,12/31�`1/3,30
950180059,0,�s���{��,1010313,����̸�γ��ݻ���ݶ�,�Љ���@�l���m��,3200851,�Ȗ،��F�s�{�s�ߓc��3381�Ԓn,028-632-7555,028-632-7551,�Љ���@�l�i�Ћ��ȊO�j,,۳���ιݼ��̱а������,�V�l�ی��{�݃t�@�~�[����̌�,028-632-7577,3200851,9201,�Ȗ،��F�s�{�s�ߓc��3375�Ԓn,���V�l�ی��{��,۳���ιݼ��̱а������,�V�l�ی��{�݃t�@�~�[����̌�,028-632-7577,028-632-7571,,,,,,,,,,
950180067,0,�s���{��,3002763,�خ�γ��ݼ���ݾ�ݼ�ݶ�,��Ö@�l�Вc�S�m��,3210953,�Ȗ،��F�s�{�s���h���񒚖�1��1��,028-635-1110,028-637-4871,��Ö@�l,,ν�߱�����,�z�X�s�A�F�s�{,028-636-9666,3210953,9201,�Ȗ،��F�s�{�s���h���񒚖�1��1��,���V�l�ی��{��,ν�߱�����,�z�X�s�A�F�s�{,028-636-9666,028-638-0379,,,,,,,,,,
950180067,0,�s���{��,3002763,�خ�γ��ݼ���ݾ�ݼ�ݶ�,��Ö@�l�Вc�S�m��,3210953,�Ȗ،��F�s�{�s���h���񒚖�1��1��,028-635-1110,028-637-4871,��Ö@�l,,ν�߱�����,�z�X�s�A�F�s�{,028-636-9666,3210953,9201,�Ȗ،��F�s�{�s���h���񒚖�1��1��,�Z�������×{���,ν�߱�����,�z�X�s�A�F�s�{,028-636-9666,028-637-4871,,,,,,,,,,
950180067,0,�s���{��,3002763,�خ�γ��ݼ���ݾ�ݼ�ݶ�,��Ö@�l�Вc�S�m��,3210953,�Ȗ،��F�s�{�s���h���񒚖�1��1��,028-635-1110,028-637-4871,��Ö@�l,,ν�߱�����,�z�X�s�A�F�s�{,028-636-9666,3210953,9201,�Ȗ،��F�s�{�s���h���񒚖�1��1��,�ʏ����n�r���e�[�V����,ν�߱�����,�z�X�s�A�F�s�{,028-636-9666,028-637-4871,,��,��,��,��,��,��,,8/12�`8/17�C12/30�`1/3,30
950180075,0,�s���{��,4010682,�޸�·ޮ���γ�������خ��ɳ���ݷ��,�Ɨ��s���@�l�n���Ë@�\���i�@�\,1088583,�����s�`�捂�֎O����22��12��,03-5791-8220,03-5791-8258,���̑��@�l,,������ޮ���̿޸����۳���ιݼ��,���݂̂�a�@�������V�l�ی��{��,028-655-6601,3210143,9201,�Ȗ،��F�s�{�s�썂����11��17��,���V�l�ی��{��,������ޮ���̿޸����۳���ιݼ��,���݂̂�a�@�������V�l�ی��{��,028-655-6601,028-655-6806,,,,,,,,,,
950180075,0,�s���{��,4010682,�޸�·ޮ���γ�������خ��ɳ���ݷ��,�Ɨ��s���@�l�n���Ë@�\���i�@�\,1088583,�����s�`�捂�֎O����22��12��,03-5791-8220,03-5791-8258,���̑��@�l,,������ޮ���̿޸����۳���ιݼ��,���݂̂�a�@�������V�l�ی��{��,028-655-6601,3210143,9201,�Ȗ،��F�s�{�s�썂����11��17��,�Z�������×{���,������ޮ���̿޸����۳���ιݼ��,���݂̂�a�@�������V�l�ی��{��,028-655-6601,028-655-6806,,,,,,,,,,
950180075,0,�s���{��,4010682,�޸�·ޮ���γ�������خ��ɳ���ݷ��,�Ɨ��s���@�l�n���Ë@�\���i�@�\,1088583,�����s�`�捂�֎O����22��12��,03-5791-8220,03-5791-8258,���̑��@�l,,������ޮ���̿޸����۳���ιݼ��,���݂̂�a�@�������V�l�ی��{��,028-655-6601,3210143,9201,�Ȗ،��F�s�{�s�썂����11��17��,�ʏ����n�r���e�[�V����,������ޮ���̿޸����۳���ιݼ��,���݂̂�a�@�������V�l�ی��{��,028-655-6601,028-655-6806,,��,��,��,��,��,,,12/29�`1/3,30
950180083,0,�s���{��,3005170,�خ�γ��ݼ�������϶�,��Ö@�l�Вc�|�R��,3210954,�Ȗ،��F�s�{�s������꒚��3�Ԓn11��,028-634-2100,028-637-0479,��Ö@�l,,�خ�γ��ݼ�������϶�����۳���ιݼ�²��ɻ�,��Ö@�l�Вc�|�R����V�l�ی��{�݂������̋�,028-613-3225,3210973,9201,�Ȗ،��F�s�{�s��]��1104�Ԓn4��,���V�l�ی��{��,�خ�γ��ݼ�������϶�����۳���ιݼ�²��ɻ�,��Ö@�l�Вc�|�R����V�l�ی��{�݂������̋�,028-613-3225,028-613-3202,,,,,,,,,,
950180083,0,�s���{��,3005170,�خ�γ��ݼ�������϶�,��Ö@�l�Вc�|�R��,3210954,�Ȗ،��F�s�{�s������꒚��3�Ԓn11��,028-634-2100,028-637-0479,��Ö@�l,,�خ�γ��ݼ�������϶�����۳���ιݼ�²��ɻ�,��Ö@�l�Вc�|�R����V�l�ی��{�݂������̋�,028-613-3225,3210973,9201,�Ȗ،��F�s�{�s��]��1104�Ԓn4��,�Z�������×{���,�خ�γ��ݼ�������϶�����۳���ιݼ�²��ɻ�,��Ö@�l�Вc�|�R����V�l�ی��{�݂������̋�,028-613-3225,028-613-3202,,,,,,,,,,
950180083,0,�s���{��,3005170,�خ�γ��ݼ�������϶�,��Ö@�l�Вc�|�R��,3210954,�Ȗ،��F�s�{�s������꒚��3�Ԓn11��,028-634-2100,028-637-0479,��Ö@�l,,�خ�γ��ݼ�������϶�����۳���ιݼ�²��ɻ�,��Ö@�l�Вc�|�R����V�l�ی��{�݂������̋�,028-613-3225,3210973,9201,�Ȗ،��F�s�{�s��]��1104�Ԓn4��,�ʏ����n�r���e�[�V����,�خ�γ��ݼ�������϶�����۳���ιݼ�²��ɻ�,��Ö@�l�Вc�|�R����V�l�ی��{�݂������̋�,028-613-3225,028-613-3202,,��,��,��,��,��,,��,,50
952180016,0,�s���{��,3002045,�خ�γ��ݼ޹���,��Ö@�l���[��,3291102,�Ȗ،��F�s�{�s����748�Ԓn,028-673-0011,028-673-7711,��Ö@�l,,����۳���ιݼ�¼׻�޿�,���V�l�ی��{�݂��炳����,028-673-8888,3291102,9201,�Ȗ،��F�s�{�s����771�Ԓn,���V�l�ی��{��,����۳���ιݼ�¼׻�޿�����,���V�l�ی��{�݂��炳����,028-673-8888,028-673-8977,,,,,,,,,,
952180016,0,�s���{��,3002045,�خ�γ��ݼ޹���,��Ö@�l���[��,3291102,�Ȗ،��F�s�{�s����748�Ԓn,028-673-0011,028-673-7711,��Ö@�l,,����۳���ιݼ�¼׻�޿�,���V�l�ی��{�݂��炳����,028-673-8888,3291102,9201,�Ȗ،��F�s�{�s����771�Ԓn,�Z�������×{���,����۳���ιݼ�¼׻�޿�,���V�l�ی��{�݂��炳����,028-673-8888,028-973-8977,,,,,,,,,,
952180016,0,�s���{��,3002045,�خ�γ��ݼ޹���,��Ö@�l���[��,3291102,�Ȗ،��F�s�{�s����748�Ԓn,028-673-0011,028-673-7711,��Ö@�l,,����۳���ιݼ�¼׻�޿�,���V�l�ی��{�݂��炳����,028-673-8888,3291102,9201,�Ȗ،��F�s�{�s����771�Ԓn,�ʏ����n�r���e�[�V����,����۳���ιݼ�¼׻�޿�,���V�l�ی��{�݂��炳����,028-673-8888,028-673-8977,��,��,��,��,��,��,,,8/13�`8/16�C12/30�`1/3,30
960190015,0,�s���{��,3001047,�خ�γ���θĶ�,��Ö@�l�k�l��,3210901,�Ȗ،��F�s�{�s���o��368�Ԓn8,028-664-1551,028-660-0819,��Ö@�l,,�����γ�ݶݺ޽ð���,���K��Ō�X�e�[�V����,028-660-7803,3210901,9201,�Ȗ،��F�s�{�s���o��413�Ԓn,�K��Ō�,�����γ�ݶݺ޽ð���,���K��Ō�X�e�[�V����,028-660-7803,028-683-5306,,��,��,��,��,��,,,12/30����1/3,
960190023,0,�s���{��,4010674,���������γ������޹ݶݺ޷����,���v�Вc�@�l�Ȗ،��Ō싦��,3200065,�Ȗ،��F�s�{�s���3337�Ԓn1,028-625-6141,028-625-8988,�Вc�E���c,,����γ�ݶݺ޽ð��� �����,�Ƃ����K��Ō�X�e�[�V�������݂̂�,028-612-6103,3200852,9201,�Ȗ،��F�s�{�s���u�㒬643�Ԓn1,�K��Ō�,����γ�ݶݺ޽ð��ݳ����,�Ƃ����K��Ō�X�e�[�V�������݂̂�,028-612-6103,028-612-6104,,��,��,��,��,��,,,8/13�`8/16�C12/29�`1/3,
960190049,0,�s���{��,3005410,�خ�γ��ݼ����ֳ����,��Ö@�l�Вc�m����,3200038,�Ȗ،��F�s�{�s�����u�꒚��7��38��,028-622-2222,028-624-2228,��Ö@�l,,γ�ݶݺ޽ð��� μ�޵�,�K��Ō�X�e�[�V���������u,028-623-0337,3200038,9201,�Ȗ،��F�s�{�s�����u�꒚��7��38��,�K��Ō�,γ�ݶݺ޽ð���μ�޵�,�K��Ō�X�e�[�V���������u,028-623-0337,028-622-2598,,��,��,��,��,��,��,,8/14�C15�C12/31�`1/3,
960190056,0,�s���{��,8012064,����ιݲخ����·���޳�б�,�Ȗؕی���Ð��������g��,3200061,�Ȗ،��F�s�{�s��ؒ��񒚖�1028�Ԓn17,028-600-1608,028-600-1609,����,,���߰�ð���Ƽ�,�w���p�[�X�e�[�V������,028-600-1602,3200061,9201,�Ȗ،��F�s�{�s��ؒ��񒚖�1028�Ԓn17,�K����,���߰�ð���Ƽ�,�w���p�[�X�e�[�V������,028-600-1602,028-600-1612,,��,��,��,��,��,��,��,12/29�`1/3,
960190064,0,�s���{��,3005113,�خ�γ��ݼ���ݾ�ݼ�ݶ�,��Ö@�l�Вc�S�m��,3210953,�Ȗ،��F�s�{�s���h���񒚖�1��1��,028-635-1110,028-637-4871,��Ö@�l,,���ʼγ�ݶݺ޽ð���,�{�̋��K��Ō�X�e�[�V����,028-688-0372,3210966,9201,�Ȗ،��F�s�{�s����O����13��1���@�쑽��}���V����202,�K��Ō�,���ʼγ�ݶݺ޽ð���,�{�̋��K��Ō�X�e�[�V����,028-688-0372,028-688-0373,,��,��,��,��,��,,,12/30�`1/3,
960190072,9201,�F�s�{�s,1009232,����̸�γ��ݵݼ�޲��ݻ�����������޹ݻ�����,�Љ���@�l�������c�ϐ���x���Ȗ،��ϐ���,3210974,�Ȗ،��F�s�{�s�|�ђ�911�Ԓn1,028-626-1500,028-626-5640,�Љ���@�l�i�Ћ��ȊO�j,,γ�ݶݺ޽ð���ί�,�K��Ō�X�e�[�V�����ق���,028-626-5739,3210974,9201,�Ȗ،��F�s�{�s�|�ђ�958�Ԓn,������x��,γ�ݶݺ޽ð���ί�,�K��Ō�X�e�[�V�����ق���,028-626-5739,028-625-8201,,��,��,��,��,��,��,,6����2���j���C12/29�`1/3�C��2�y�j��,
960190072,0,�s���{��,1009232,����̸�γ��ݵݼ�޲��ݻ�����������޹ݻ�����,�Љ���@�l�������c�ϐ���x���Ȗ،��ϐ���,3210974,�Ȗ،��F�s�{�s�|�ђ�911�Ԓn1,028-626-1500,028-626-5640,�Љ���@�l�i�Ћ��ȊO�j,,γ�ݶݺ޽ð���ί�,�K��Ō�X�e�[�V�����ق���,028-626-5739,3210974,9201,�Ȗ،��F�s�{�s�|�ђ�958�Ԓn,�K��Ō�,γ�ݶݺ޽ð���ί�,�K��Ō�X�e�[�V�����ق���,028-626-5739,028-625-8201,,��,��,��,��,��,��,,6����2���j���C12/29�`1/3�C��2�y�j��,
960190080,0,�s���{��,8012064,����ιݲخ����·���޳�б�,�Ȗؕی���Ð��������g��,3200061,�Ȗ،��F�s�{�s��ؒ��񒚖�1028�Ԓn17,028-600-1608,028-600-1609,����,,γ�ݶݺ޽ð���Ƽ�,�K��Ō�X�e�[�V������,028-600-1604,3200061,9201,�Ȗ،��F�s�{�s��ؒ��񒚖�1028�Ԓn17,�K��Ō�,γ�ݶݺ޽ð���Ƽ�,�K��Ō�X�e�[�V������,028-600-1604,028-600-1605,,��,��,��,��,��,��,,12/29�`1/3,
960190122,0,�s���{��,5015292,ճ��ݶ޲��γ�ݶݺ޽ð���ʰ�,�L����ЖK��Ō�X�e�[�V�����n�[�g,3210912,�Ȗ،��F�s�{�s�Έ䒬3261�Ԓn4,028-657-7797,028-657-8883,�c���@�l,,γ�ݶݺ޽ð���ʰ�,�K��Ō�X�e�[�V�����n�[�g,028-666-8688,3210912,9201,�Ȗ،��F�s�{�s�Έ䒬3261�Ԓn4,�K��Ō�,γ�ݶݺ޽ð���ʰ�,�K��Ō�X�e�[�V�����n�[�g,028-666-8688,028-657-8883,,��,��,��,��,��,,,8/13�`8/15�C12/30�`1/3,
960190130,0,�s���{��,5014345,ճ��ݶ޲�������,�L����Ђ݂�̓m,3200003,�Ȗ،��F�s�{�s�L����񒚖�53�Ԓn8,028-643-8213,028-643-8213,�c���@�l,,γ�ݶݺ޽ð��������,�K��Ō�X�e�[�V�����݂�̓m,028-683-7821,3210904,9201,�Ȗ،��F�s�{�s�z���񒚖�4��5��,�K��Ō�,γ�ݶݺ޽ð��������,�K��Ō�X�e�[�V�����݂�̓m,028-683-7821,028-683-7822,,��,��,��,��,��,,,8/13�`8/15�C12/30�`1/3,
960190148,0,�s���{��,5013016,ճ��ݶ޲�������ݽ��,�L����ЃA�h�o���X�P�A,3210982,�Ȗ،��F�s�{�s��K�P����136�Ԓn53,028-660-9977,028-660-9977,�c���@�l,,�����ݽ��γ�ݶݺ޽ð���,�A�h�o���X�P�A�K��Ō�X�e�[�V����,028-613-0078,3210982,9201,�Ȗ،��F�s�{�s��K�P����136�Ԓn69,�K��Ō�,�����ݽ��γ�ݶݺ޽ð���,�A�h�o���X�P�A�K��Ō�X�e�[�V����,028-613-0078,028-613-0678,,��,��,��,��,��,,,12/29�`1/3,
960190155,0,�s���{��,5014923,ճ��ݶ޲�����,�L����АS��,3200015,�Ȗ،��F�s�{�s������18��11��,028-600-3735,028-600-3736,�c���@�l,,γ�ݶݺ޽ð��ݺ��,�K��Ō�X�e�[�V����������,028-600-3735,3200015,9201,�Ȗ،��F�s�{�s������18��11��,�K��Ō�,γ�ݶݺ޽ð��ݺ��,�K��Ō�X�e�[�V����������,028-600-3735,028-600-3736,,��,��,��,��,��,,,8/13�`8/16�C12/30�`1/3,
960190239,0,�s���{��,,����ݲخ�γ�����޶�,�Вc��Ö@�l�˓c��,3200043,�Ȗ،��F�s�{�s���񒚖�3��34��,028-622-0476,028-622-9279,��Ö@�l,,��׶޵�������,�����炪�����P�A�Z���^�[,028-680-5490,3200061,9201,�Ȗ،��F�s�{�s��ؒ��񒚖�2570�Ԓn12,�Z�������������,��׶޵�������,�����炪�����P�A�Z���^�[,028-680-5494,028-680-5497,,,,,,,,,,20
960190239,0,�s���{��,,����ݲخ�γ�����޶�,�Вc��Ö@�l�˓c��,3200043,�Ȗ،��F�s�{�s���񒚖�3��34��,028-622-0476,028-622-9279,��Ö@�l,,��׶޵�������,�����炪�����P�A�Z���^�[,028-680-5490,3200061,9201,�Ȗ،��F�s�{�s��ؒ��񒚖�2570�Ԓn12,�ʏ����,��׶޵�������,�����炪�����P�A�Z���^�[,028-680-5493,028-680-5497,,��,��,��,��,��,��,��,"12/30�`1/3
12/30�`1/3",20
960190239,0,�s���{��,,����ݲخ�γ�����޶�,�Вc��Ö@�l�˓c��,3200043,�Ȗ،��F�s�{�s���񒚖�3��34��,028-622-0476,028-622-9279,��Ö@�l,,��׶޵�������,�����炪�����P�A�Z���^�[,028-680-5490,3200061,9201,�Ȗ،��F�s�{�s��ؒ��񒚖�2570�Ԓn12,�K����,��׶޵�������,�����炪�����P�A�Z���^�[,028-680-5492,028-680-5497,��,��,��,��,��,��,��,��,,
960190254,0,�s���{��,,��޼������ٸ,������Ђ��邭,3200847,�Ȗ،��F�s�{�s��J��17�Ԓn16,028-643-5586,028-678-8796,�c���@�l,,γ�ݶݺ޽ð��ݱٸ,�K��Ō�X�e�[�V�������邭,028-643-5586,3200847,9201,�Ȗ،��F�s�{�s��J��17�Ԓn16,�K��Ō�,γ�ݶݺ޽ð��ݱٸ,�K��Ō�X�e�[�V�������邭,028-643-5586,028-678-8796,,��,��,��,��,��,,,8/13�`8/16�C12/29�`1/3,
960190270,0,�s���{��,,�޳�޳�޲���̨���,������ЃI�t�B�X��,3210982,�Ȗ،��F�s�{�s��K�P����135�Ԓn8,028-680-6302,028-680-6391,�c���@�l,,γ�ݶݺ޽ð���ж�,�K��Ō�X�e�[�V�����݂���,028-680-6390,3210982,9201,�Ȗ،��F�s�{�s��K�P����135�Ԓn8,�K��Ō�,γ�ݶݺ޽ð���ж�,�K��Ō�X�e�[�V�����݂���,028-680-6390,028-680-6391,,��,��,��,��,��,,,8/13�`8/15�C12/29�`1/3,
960190288,0,�s���{��,,��޼������ڱ�,������Ѓt���A�X,4093866,�R�����������S���a������1514�Ԓn,055-234-5031,055-234-5032,�c���@�l,,�ڱ�γ�ݶݺ޽ð��ݳ����,�t���A�X�K��Ō�X�e�[�V�����F�s�{,028-612-4564,3210941,9201,�Ȗ،��F�s�{�s������񒚖�3��5���@������Ѓe�C�G�t�V�[�P�k������,�K��Ō�,�ڱ�γ�ݶݺ޽ð��ݳ����,�t���A�X�K��Ō�X�e�[�V�����F�s�{,028-612-4564,028-612-4584,,��,��,��,��,��,,,12/30�`1/3,
960190296,0,�s���{��,,��޲خ��޼�����,�����������������������,3210932,�Ȗ،��F�s�{�s�����{��354�Ԓn13,028-666-5420,028-666-5460,�c���@�l,,������γ�ݶݺ޽ð��ݳ����,WADEWADE�K��Ō�X�e�[�V�����F�s�{,028-666-5420,3210923,9201,�Ȗ،��F�s�{�s���I��2912�Ԓn17,�K��Ō�,������γ�ݶݺ޽ð��ݳ����,WADEWADE�K��Ō�X�e�[�V�����F�s�{,028-666-5420,028-666-5460,,��,��,��,��,��,,,12/30�`1/3,
960190304,0,�s���{��,,�޳�޳�޲��إذ�,������Ѓ��E���[�t,3210157,�Ȗ،��F�s�{�s���c��41�Ԓn,028-611-1970,028-611-1971,�c���@�l,,�����γ�ݶݺ޽ð���ײ��,���n�r���K��Ō�X�e�[�V�������C�u,028-611-1970,3210157,9201,�Ȗ،��F�s�{�s���c��41�Ԓn,�K��Ō�,�����γ�ݶݺ޽ð���ײ��,���n�r���K��Ō�X�e�[�V�������C�u,028-611-1970,028-611-1971,,��,��,��,��,��,,,12/30�`1/3,
960190312,0,�s���{��,,ճ��ݶ޲��è�����ߨ���,�L����Ѓe�B�E�I�[�E�s�B�E�G�X,3200838,�Ȗ،��F�s�{�s�g��񒚖�8��23��,028-634-5432,028-638-5133,�c���@�l,,į�߽�����γ�ݶݺ�����ؽð���,�s�n�o�r�i�g�b�v�X�j���݂̂�K��Ō샊�n�r���X�e�[�V����,028-666-6575,3200838,9201,�Ȗ،��F�s�{�s�g��񒚖�8��23��,�K��Ō�,į�߽޳����γ�ݶݺ�����ؽð���,�s�n�o�r�i�g�b�v�X�j���݂̂�K��Ō샊�n�r���X�e�[�V����,028-666-6575,028-666-5333,,��,��,��,��,��,,,8/13�`8/16�C12/30�`1/3,
960190338,0,�s���{��,,��޼��޲���޲�����ȯ�ܰ�,������Ѝݑ�x���l�b�g���[�N,3210346,�Ȗ،��F�s�{�s���r�j��3612�Ԓn12,028-612-4047,028-612-4048,�c���@�l,,γ�ݶݺ޽ð�����н޷,�K��Ō�X�e�[�V�����Ԃ݂���,028-612-4047,3200058,9201,�Ȗ،��F�s�{�s��ˍՎO����3��24���@KS�n�C�c�V101��,�K��Ō�,γ�ݶݺ޽ð�����н޷,�K��Ō�X�e�[�V�����Ԃ݂���,028-612-4047,028-612-4048,,��,��,��,��,��,,,12/30�`1/3,
960190346,0,�s���{��,,����̸�γ��ݾ�����,�Љ���@�l���b��,3200075,�Ȗ،��F�s�{�s��ؖ{��1768�Ԓn,028-665-0520,028-665-0370,�Љ���@�l�i�Ћ��ȊO�j,,γ�ݶݺ޽ð��ݱ����,�K��Ō�X�e�[�V��������,028-666-8260,3200075,9201,�Ȗ،��F�s�{�s��ؖ{��1785�Ԓn12,�K��Ō�,γ�ݶݺ޽ð��ݱ����,�K��Ō�X�e�[�V��������,028-666-8260,028-666-8270,,��,��,��,��,��,,,12/29�`1/3,
960190353,0,�s���{��,,����ȯĶ�޼��޲��,�C���^�[�l�b�g�������,3210901,�Ȗ،��F�s�{�s���o��1777�Ԓn3,028-689-3456,028-678-6900,�c���@�l,,�����γ�ݶݺ�����ؽð���ƺ��,���݂̂�K��Ō샊�n�r���X�e�[�V�����ɂ�����,028-660-2510,3210901,9201,�Ȗ،��F�s�{�s���o��1777�Ԓn3,�K��Ō�,�����γ�ݶݺ�����ؽð���ƺ��,���݂̂�K��Ō샊�n�r���X�e�[�V�����ɂ�����,028-660-2510,028-678-6900,��,��,��,��,��,��,��,��,12/30�`1/3�C8/13�`8/15,
960190395,0,�s���{��,,��޼��޲����̨����,������Ђm�E�t�B�[���h,5300004,���{���s�k�擰���l�꒚��4��4���@�A�N�A��������,06-6343-0600,06-6343-0601,�c���@�l,,γ�ݶݺ޽ð����ޭ�ݳ����,�K��Ō�X�e�[�V�����f���[���F�s�{,028-635-5606,3210954,9201,�Ȗ،��F�s�{�s������l����8��21���@�t�E�h�r��301����,�K��Ō�,γ�ݶݺ޽ð����ޭ�ݳ����,�K��Ō�X�e�[�V�����f���[���F�s�{,028-635-5606,028-635-5607,,��,��,��,��,��,��,,12/29�`1/3,
960190403,0,�s���{��,,��޼��޲��Ư���ø�,������Г��ăe�N�m,1010024,�����s���c��_�c�a��1�Ԓn7��9���؃r��3F,03-5809-1852,03-5809-1853,�c���@�l,,����γ�ݶݺ�����ؽð���,�͂Ȃ܂�K��Ō샊�n�r���X�e�[�V����,028-678-2990,3200065,9201,�Ȗ،��F�s�{�s���832�Ԓn29�@���W�f���X����105��,�K��Ō�,����γ�ݶݺ�����ؽð���,�͂Ȃ܂�K��Ō샊�n�r���X�e�[�V����,028-678-2990,028-678-2992,��,��,��,��,��,��,��,��,,
960190411,0,�s���{��,,��޲خ��޼��޲��,�����������������������,3210932,�Ȗ،��F�s�{�s�����{��354�Ԓn13,028-666-5420,028-666-5460,�c���@�l,,�����Ű��ð��ݳ����,KODOMOTO�i�[�X�X�e�[�V�������݂̂�,028-615-7420,3210923,9201,�Ȗ،��F�s�{�s���I��2913�Ԓn1,�K��Ō�,�����Ű��ð��ݳ����,KODOMOTO�i�[�X�X�e�[�V�������݂̂�,028-615-7420,028-615-7430,��,��,��,��,��,��,��,��,,
960190445,0,�s���{��,,��޼��޲�����޽,������ЃA���r�X,1040031,�����s�����拞���꒚��6��1��,03-6262-5105,03-6262-5106,�c���@�l,,��ݶ�γ�ݶݺ޽ð��ݳ����,��S�ٖK��Ō�X�e�[�V�����F�s�{,028-611-3428,3200046,9201,�Ȗ،��F�s�{�s����̑�12�Ԓn22,�K��Ō�,��ݶ�γ�ݶݺ޽ð��ݳ����,��S�ٖK��Ō�X�e�[�V�����F�s�{,028-611-3428,028-611-3438,,��,��,��,��,��,,,12/30�`1/3,
960190452,0,�s���{��,,��޼��޲��ܲè�����ح�,������Ђx�s�v,3200834,�Ȗ،��F�s�{�s�z��񒚖�14��14��,028-612-7453,028-612-7459,�c���@�l,,γ�ݶݺ޽ð�����Ƚ(��Ƚ),�K��Ō�X�e�[�V����Fullness�i�ӂ�˂��j,028-612-7453,3200834,9201,�Ȗ،��F�s�{�s�z��񒚖�14��14��,�K��Ō�,γ�ݶݺ޽ð�����Ƚ(��Ƚ),�K��Ō�X�e�[�V����Fullness�i�ӂ�˂��j,028-612-7453,028-612-7459,,��,��,��,��,��,,��,1/1�`1/3,
960190460,0,�s���{��,,�خ�γ��ݼ���ݼ��̳��,��Ö@�l�Вc�Õ���,2550003,�_�ސ쌧���S��钬���1188�Ԓn,0463-60-2325,0463-60-2328,��Ö@�l,,γ�ݶݺ޽ð��ݾ�׷�,�K��Ō�X�e�[�V���������炬,028-678-2350,3291105,9201,�Ȗ،��F�s�{�s�����{��2389�Ԓn1,�K��Ō�,γ�ݶݺ޽ð��ݾ�׷�,�K��Ō�X�e�[�V���������炬,028-678-2350,028-678-2733,,��,��,��,��,��,,,12/29�`1/3,
960190494,0,�s���{��,,��޼��޲�����޽,������ЃA���r�X,1040031,�����s�����拞���꒚��6��1��,03-6262-5105,03-6262-5106,�c���@�l,,��ݶ�γ�ݶݺ޽ð��ݳ�����,��S�ٖK��Ō�X�e�[�V�����F�s�{�U,028-612-2101,3200851,9201,�Ȗ،��F�s�{�s�ߓc��552�Ԓn,�K��Ō�,��ݶ�γ�ݶݺ޽ð��ݳ�����,��S�ٖK��Ō�X�e�[�V�����F�s�{�U,028-612-2101,028-612-2031,,��,��,��,��,��,,,12/30�`1/3,
960190502,0,�s���{��,,��޼��޲��̧���Ű�,������Ѓt�@�[�X�g�i�[�X,1050004,�����s�`��V���񒚖�12��16��,03-5472-7665,03-3433-8060,�c���@�l,,γ�ݶݺ޽ð��ݱ�ҳ�������,�K��Ō�X�e�[�V��������߉F�s�{�ߓc,028-610-7210,3200851,9201,�Ȗ،��F�s�{�s�ߓc��3389�Ԓn5�@���]���h�x����̌�106,�K��Ō�,γ�ݶݺ޽ð��ݱ�ҳ�������,�K��Ō�X�e�[�V��������߉F�s�{�ߓc,028-610-7210,028-638-7200,,��,��,��,��,��,��,��,12/31�`1/3,
960190528,0,�s���{��,,��޼��޲��Ϻ���,������Б��̎�,3792304,�Q�n�����c�s�匴��156�Ԓn3,0277-46-7010,0277-46-7020,�c���@�l,,γ�ݶݺ޽ð���Ϻ��å�����,�K��Ō�X�e�[�V�������̎�E���݂̂�,028-680-4377,3210954,9201,�Ȗ،��F�s�{�s�����򎵒���32��16��,�K��Ō�,γ�ݶݺ޽ð���Ϻ��å�����,�K��Ō�X�e�[�V�������̎�E���݂̂�,028-680-4377,028-680-4378,,��,��,��,��,��,��,��,���~���ԁC�N���N�n�i�N�x�ɂ��ϓ�����j,
960190536,0,�s���{��,,��޼��޲�������޲�,������Г��̑�n,3200065,�Ȗ،��F�s�{�s���1219�Ԓn1,028-902-1121,028-902-1144,�c���@�l,,γ�ݶݺޱ��,�K��Ō삠����,028-902-1124,3200065,9201,�Ȗ،��F�s�{�s���1224�Ԓn,�K��Ō�,γ�ݶݺޱ��,�K��Ō삠����,028-902-1124,028-612-1174,,��,��,��,��,��,,,12/31����1/3������,
960190551,0,�s���{��,,��޼��޲��̧���Ű�,������Ѓt�@�[�X�g�i�[�X,1050004,�����s�`��V���񒚖�12��16��,03-5472-7665,03-3433-8060,�c���@�l,,γ�ݶݺ޽ð��ݱ��ղ���,�K��Ō�X�e�[�V��������߂䂢�̓m,028-670-3245,3213226,9201,�Ȗ،��F�s�{�s�䂢�̓m�ܒ���6��21���@2�K,�K��Ō�,γ�ݶݺ޽ð��ݱ��ղ���,�K��Ō�X�e�[�V��������߂䂢�̓m,028-670-3245,028-670-5003,,��,��,��,��,��,��,��,12/31�`1/3,
960190569,0,�s���{��,,��޼��޲����۸,������Ћ��\,3270027,�Ȗ،�����s��a��2585�Ԓn,0283-22-6479,0283-22-7006,�c���@�l,,̧�ذγ�ݶݺ޽ð���,�t�@�~���[�K��Ō�X�e�[�V����,028-305-4379,3210106,9201,�Ȗ،��F�s�{�s�㉡�c��1338�Ԓn15�@���]���}�X�u�`102����,�K��Ō�,̧�ذγ�ݶݺ޽ð���,�t�@�~���[�K��Ō�X�e�[�V����,028-305-4379,028-307-7689,,��,��,��,��,��,,,12/30�`1/3,
960190577,0,�s���{��,,�خ�γ��ݻݴ���,��Ö@�l�^�i��,3200843,�Ȗ،��F�s�{�s�ԉ���17��1��,028-688-0456,028-688-0457,��Ö@�l,,�·γ�ݶݺ޽ð���,�����K��Ō�X�e�[�V����,028-689-8367,3200843,9201,�Ȗ،��F�s�{�s�ԉ���17��12���@�q���r��2�K,�K��Ō�,�·γ�ݶݺ޽ð���,�����K��Ō�X�e�[�V����,028-689-8367,028-689-8368,,��,��,��,��,��,,,12/30�`1/3,
960190585,0,�s���{��,,��޼��޲��¸�,������Ѓc�N�C,2330002,�_�ސ쌧���l�s�`����剪���꒚��6��1��,045-842-4115,045-842-0249,�c���@�l,,¸������γ�ݶݺ޽ð���,�c�N�C�F�s�{�K��Ō�X�e�[�V����,028-650-3977,3200047,9201,�Ȗ،��F�s�{�s��̑�񒚖�16��21���@ID�r��102��,�K��Ō�,¸������γ�ݶݺ޽ð���,�c�N�C�F�s�{�K��Ō�X�e�[�V����,028-650-3977,028-623-5500,,��,��,��,��,��,,��,12/30�`1/3,